Reaction Details
TargetCannabinoid receptor 1
LigandBDBM35877
Substrate/CompetitorBDBM35866
Meas. Tech.GTP-gamma-S Binding Assay
pH7.4±n/a
Temperature303.15±n/a K
IC50 8±n/a nM
Citation Boström, JBerggren, KElebring, TGreasley, PJWilstermann, M Scaffold hopping, synthesis and structure-activity relationships of 5,6-diaryl-pyrazine-2-amide derivatives: a novel series of CB1 receptor antagonists. Bioorg Med Chem15:4077-84 (2007) 
 
Cannabinoid receptor 1
Name:Cannabinoid receptor 1
Type:G Protein-Coupled Receptor (GPCR)
Mol. Mass.:52868.96
Organism:Homo sapiens (Human)
Description:P21554
Residue:472
BDBM35877
BDBM35866
NameBDBM35877
Synonyms:5,6-bis-(4-methoxy-phenyl)-pyrazine-2-carboxylicacid cyclohexylamide CHEMBL227840 | N-cyclohexyl-5,6-bis(4-methoxyphenyl)pyrazine-2-carboxamide
TypeSmall organic molecule
Emp. Form.C25H27N3O3
Mol. Mass.417.5002
SMILESCOc1ccc(cc1)-c1ncc(nc1-c1ccc(OC)cc1)C(=O)NC1CCCCC1