Reaction Details
TargetCannabinoid receptor 1
LigandBDBM35880
Substrate/CompetitorBDBM35866
Meas. Tech.GTP-gamma-S Binding Assay
pH7.4±n/a
Temperature303.15±n/a K
IC50 2790±n/a nM
Citation Boström, JBerggren, KElebring, TGreasley, PJWilstermann, M Scaffold hopping, synthesis and structure-activity relationships of 5,6-diaryl-pyrazine-2-amide derivatives: a novel series of CB1 receptor antagonists. Bioorg Med Chem15:4077-84 (2007) 
 
Cannabinoid receptor 1
Name:Cannabinoid receptor 1
Type:G Protein-Coupled Receptor (GPCR)
Mol. Mass.:52868.96
Organism:Homo sapiens (Human)
Description:P21554
Residue:472
BDBM35880
BDBM35866
NameBDBM35880
Synonyms:5,6-diaryl-pyrazine-2-amide derivative, 7a CHEMBL225241 | N,5,6-triphenylpyrazine-2-carboxamide
TypeSmall organic molecule
Emp. Form.C23H17N3O
Mol. Mass.351.4006
SMILESO=C(Nc1ccccc1)c1cnc(-c2ccccc2)c(n1)-c1ccccc1