Reaction Details
TargetCannabinoid receptor 1
LigandBDBM35883
Substrate/CompetitorBDBM35866
Meas. Tech.GTP-gamma-S Binding Assay
pH7.4±n/a
Temperature303.15±n/a K
IC50 80±n/a nM
Citation Boström, JBerggren, KElebring, TGreasley, PJWilstermann, M Scaffold hopping, synthesis and structure-activity relationships of 5,6-diaryl-pyrazine-2-amide derivatives: a novel series of CB1 receptor antagonists. Bioorg Med Chem15:4077-84 (2007) 
 
Cannabinoid receptor 1
Name:Cannabinoid receptor 1
Type:G Protein-Coupled Receptor (GPCR)
Mol. Mass.:52868.96
Organism:Homo sapiens (Human)
Description:P21554
Residue:472
BDBM35883
BDBM35866
NameBDBM35883
Synonyms:5,6-bis-(4-chloro-phenyl)-pyrazine-2-carboxylicacid phenylamide CHEMBL376828
TypeSmall organic molecule
Emp. Form.C23H15Cl2N3O
Mol. Mass.420.291
SMILESClc1ccc(cc1)-c1ncc(nc1-c1ccc(Cl)cc1)C(=O)Nc1ccccc1