Reaction Details
TargetCarbonic anhydrase 2
LigandBDBM35999
Substrate/Competitorn/a
Meas. Tech.SPR biosensor assay Biacore T100
pH7.4±n/a
Temperature298.15±n/a K
Kd 2180±n/a nM
KOFF 110000 s-1
KON 0.24 M-1s-1
Citation Navratilova, IHopkins, AL Fragment Screening by Surface Plasmon Resonance ACS Med Chem Lett1:44-8 (2010)  
 
Carbonic anhydrase 2
Name:Carbonic anhydrase 2
Type:Enzyme Catalytic Domain
Mol. Mass.:29115.93
Organism:Bos taurus
Description:n/a
Residue:260
BDBM35999
NameBDBM35999
Synonyms:2-methylbenzene-1-sulfonamide | SPR_3
TypeSmall organic molecule
Emp. Form.C7H9NO2S
Mol. Mass.171.217
SMILESCc1ccccc1S(N)(=O)=O