Reaction Details
TargetSliding-clamp-loader large/small subunit
LigandBDBM36314
Substrate/CompetitorBDBM50118233
Meas. Tech.colorimetric ATPase assay
pH7.5±0
Temperature298.15±0 K
Ki<2.00e+5±n/a nM
Citation Eng, KScouten-Ponticelli, SKSutton, MBerdis, A Selective Inhibition of DNA Replicase Assembly by a Non-natural Nucleotide: Exploiting the Structural Diversity of ATP-Binding Sites ACS Chem Biol5:183-94 (2010) 
 
Sliding-clamp-loader large/small subunit
Name:Sliding-clamp-loader large/small subunit
Synonyms:ATP-dependent clamp loaders gp44/62
Type:n/a
Mol. Mass.:n/a
Description:n/a
Components:This complex has 2 components.
Component 1
Name:Sliding-clamp-loader large subunit
Type:n/a
Mol. Mass.:35788.87
Organism:Enterobacteria phage T4 (Bacteriophage T4)
Description:P04526
Residue:319
Component 2
Name:Sliding-clamp-loader small subunit
Synonyms:62 Gene product 62 Sliding-clamp-loader gp44 subunit | gp62
Type:n/a
Mol. Mass.:21366.49
Organism:Enterobacteria phage T4 (Bacteriophage T4)
Description:P04527
Residue:187
BDBM36314
BDBM50118233
NameBDBM36314
Synonyms:5-amino-indolyl- 2'-deoxyriboside triphosphate | d5-AITP
TypeSmall organic molecule
Emp. Form.C13H19N2O12P3
Mol. Mass.488.2174
SMILES[H][C@]1(O)C[C@@]([H])(O[C@]1([H])COP(O)(=O)OP(O)(=O)OP(O)(O)=O)n1ccc2cc(N)ccc12