Reaction Details
TargetDNA polymerase III subunit tau
LigandBDBM36317
Substrate/CompetitorBDBM50118233
Meas. Tech.colorimetric ATPase assay
pH7.5±0
Temperature310.15±0 K
Ki 3.00e+4± 1.57e+4 nM
Citation Eng, KScouten-Ponticelli, SKSutton, MBerdis, A Selective Inhibition of DNA Replicase Assembly by a Non-natural Nucleotide: Exploiting the Structural Diversity of ATP-Binding Sites ACS Chem Biol5:183-94 (2010) 
 
DNA polymerase III subunit tau
Name:DNA polymerase III subunit tau
Type:PROTEIN
Mol. Mass.:71139.93
Organism:Escherichia coli
Description:P06710
Residue:643
BDBM36317
BDBM50118233
NameBDBM36317
Synonyms:5-ethylene-indolyl- 2'-deoxyriboside triphosphate d5-EyITP
TypeSmall organic molecule
Emp. Form.C15H20NO12P3
Mol. Mass.499.2401
SMILES[H][C@]1(O)C[C@@]([H])(O[C@]1([H])COP(O)(=O)OP(O)(=O)OP(O)(O)=O)n1ccc2cc(C=C)ccc12