Reaction Details
TargetCathepsin B
LigandBDBM36329
Substrate/CompetitorBDBM36388
Meas. Tech.Assay name: Protease Inhibition Assay
pH5.5±0
Temperature310.15±0 K
IC50 9.2e+2±n/a nM
Citation Kato, DBoatright, KMBerger, ABNazif, TBlum, GRyan, CChehade, KASalvesen, GSBogyo, M Activity-based probes that target diverse cysteine protease families. Nat Chem Biol1:33-8 (2005) 
 
Cathepsin B
Name:Cathepsin B
Type:Protein
Mol. Mass.:37463.53
Organism:Rattus norvegicus
Description:P00787
Residue:339
BDBM36329
BDBM36388
NameBDBM36329
Synonyms:Z-LG-AOMK 9c
TypeSmall organic molecule
Emp. Form.C26H32N2O6
Mol. Mass.468.5421
SMILESCC(C)C[C@H](NC(=O)OCc1ccccc1)C(=O)NCC(=O)COC(=O)c1c(C)cccc1C