Reaction Details
TargetCathepsin Z
LigandBDBM36331
Substrate/CompetitorBDBM36388
Meas. Tech.Assay name: Protease Inhibition Assay
pH5.5±0
Temperature310.15±0 K
IC50 4.7e+3±n/a nM
Citation Kato, DBoatright, KMBerger, ABNazif, TBlum, GRyan, CChehade, KASalvesen, GSBogyo, M Activity-based probes that target diverse cysteine protease families. Nat Chem Biol1:33-8 (2005) 
 
Cathepsin Z
Name:Cathepsin Z
Type:Protein
Mol. Mass.:34197.61
Organism:Rattus norvegicus
Description:Q9R1T3
Residue:306
BDBM36331
BDBM36388
NameBDBM36331
Synonyms:Ac-YFR-AMOK 10b
TypeSmall organic molecule
Emp. Form.C36H44N6O7
Mol. Mass.672.7706
SMILES[#6]-[#6](=O)-[#7]-[#6@@H](-[#6]-c1ccc(-[#8])cc1)-[#6](=O)-[#7]-[#6@@H](-[#6]-c1ccccc1)-[#6](=O)-[#7]-[#6@@H](-[#6]-[#6]-[#6]\[#7]=[#6](\[#7])-[#7])-[#6](=O)-[#6]-[#8]-[#6](=O)-c1c(-[#6])cccc1-[#6]