Reaction Details
TargetKinesin-like protein KIF11 [D130V]
LigandBDBM36350
Substrate/Competitorn/a
Meas. Tech.HCT116-D130V 3x biary selected
pH6.8±0
IC50 6.9±0.0 nM
Citation Luo, LParrish, CANevins, NMcNulty, DEChaudhari, AMCarson, JDSudakin, VShaw, ANLehr, RZhao, HSweitzer, SLad, LWood, KWSakowicz, RAnnan, RSHuang, PSJackson, JRDhanak, DCopeland, RAAuger, KR ATP-competitive inhibitors of the mitotic kinesin KSP that function via an allosteric mechanism. Nat Chem Biol3:722-6 (2007) 
 
Kinesin-like protein KIF11 [D130V]
Name:Kinesin-like protein KIF11 [D130V]
Type:PROTEIN
Mol. Mass.:119124.02
Organism:Homo sapiens (Human)
Description:Kinesin-like spindle protein HKSP
Residue:1056
BDBM36350
NameBDBM36350
Synonyms:6-[4-(Trifluoromethyl)phenyl]-3,4-dihydro-2(1H)-quinolinone GSK-1
TypeSmall organic molecule
Emp. Form.C16H12F3NO
Mol. Mass.291.2678
SMILESFC(F)(F)c1ccc(cc1)-c1ccc2NC(=O)CCc2c1