Reaction Details
TargetReceptor-interacting serine/threonine-protein kinase 1
LigandBDBM36371
Substrate/Competitorn/a
Meas. Tech.RIP1 Kinase Assay
pH7.3±0
Temperature303.15±0 K
EC50 182±0.0 nM
Citation Degterev, AHitomi, JGermscheid, MCh'en, ILKorkina, OTeng, XAbbott, DCuny, GDYuan, CWagner, GHedrick, SMGerber, SALugovskoy, AYuan, J Identification of RIP1 kinase as a specific cellular target of necrostatins. Nat Chem Biol4:313-21 (2008) 
 
Receptor-interacting serine/threonine-protein kinase 1
Name:Receptor-interacting serine/threonine-protein kinase 1
Type:Enzyme Catalytic Domain
Mol. Mass.:75926.99
Organism:Homo sapiens (Human)
Description:Q13546
Residue:671
BDBM36371
NameBDBM36371
Synonyms:5-(1H-indol-3-ylmethyl)-3-methyl-2-thioxo-4-Imidazolidinone, Nec-1 US10501473, Comparative Example 1
TypeSmall organic molecule
Emp. Form.C13H13N3OS
Mol. Mass.259.327
SMILESCN1C(=S)NC(Cc2c[nH]c3ccccc23)C1=O