Reaction Details
TargetNitric oxide synthase, inducible
LigandBDBM36395
Substrate/Competitorn/a
Meas. Tech.NOS Enzyme Inhibition Assay
pH7±0
Temperature310.15±0 K
IC50 1e+1±n/a nM
Citation Garcin, EDArvai, ASRosenfeld, RJKroeger, MDCrane, BRAndersson, GAndrews, GHamley, PJMallinder, PRNicholls, DJSt-Gallay, SATinker, ACGensmantel, NPMete, ACheshire, DRConnolly, SStuehr, DJAberg, AWallace, AVTainer, JAGetzoff, ED Anchored plasticity opens doors for selective inhibitor design in nitric oxide synthase. Nat Chem Biol4:700-7 (2008) 
 
Nitric oxide synthase, inducible
Name:Nitric oxide synthase, inducible
Type:Homodimer
Mol. Mass.:131141.95
Organism:Homo sapiens (Human)
Description:P35228
Residue:1153
BDBM36395
NameBDBM36395
Synonyms:5-Fluoro-2-thiophen-2-yl-1,2-dihydroquinazolin-4-amine, 1 | CID21192814
TypeSmall organic molecule
Emp. Form.C12H10FN3S
Mol. Mass.247.291
SMILESNC1=NC(Nc2cccc(F)c12)c1cccs1