Reaction Details
TargetNitric oxide synthase, endothelial
LigandBDBM50091817
Substrate/Competitorn/a
Meas. Tech.NOS Enzyme Inhibition Assay
pH7±0
Temperature310.15±0 K
IC50 34±n/a nM
Citation Garcin, EDArvai, ASRosenfeld, RJKroeger, MDCrane, BRAndersson, GAndrews, GHamley, PJMallinder, PRNicholls, DJSt-Gallay, SATinker, ACGensmantel, NPMete, ACheshire, DRConnolly, SStuehr, DJAberg, AWallace, AVTainer, JAGetzoff, ED Anchored plasticity opens doors for selective inhibitor design in nitric oxide synthase. Nat Chem Biol4:700-7 (2008) 
 
Nitric oxide synthase, endothelial
Name:Nitric oxide synthase, endothelial
Type:Enzyme Catalytic Domain
Mol. Mass.:133297.84
Organism:Homo sapiens (Human)
Description:P29474
Residue:1203
BDBM50091817
NameBDBM50091817
Synonyms:4-Methyl-6-propyl-pyridin-2-ylamine 4-methyl-6-propylpyridin-2-amine | CHEMBL302657
TypeSmall organic molecule
Emp. Form.C9H14N2
Mol. Mass.150.2209
SMILESCCCc1cc(C)cc(N)n1