Reaction Details
TargetPhosphatidylinositol 4,5-bisphosphate 3-kinase catalytic subunit alpha isoform/Platelet-derived growth factor receptor beta [525-1106]
LigandBDBM36408
Substrate/Competitorn/a
Meas. Tech.Tyrosine Kinase Assay
IC50 1.7e+2±n/a nM
Citation Apsel, BBlair, JAGonzalez, BNazif, TMFeldman, MEAizenstein, BHoffman, RWilliams, RLShokat, KMKnight, ZA Targeted polypharmacology: discovery of dual inhibitors of tyrosine and phosphoinositide kinases. Nat Chem Biol4:691-9 (2008) 
 
Phosphatidylinositol 4,5-bisphosphate 3-kinase catalytic subunit alpha isoform/Platelet-derived growth factor receptor beta [525-1106]
Name:Phosphatidylinositol 4,5-bisphosphate 3-kinase catalytic subunit alpha isoform/Platelet-derived growth factor receptor beta [525-1106]
Synonyms:PI3K-alpha/ PDGFR
Type:Complex
Mol. Mass.:n/a
Description:n/a
Components:This complex has 2 components.
Component 1
Name:Phosphatidylinositol 4,5-bisphosphate 3-kinase catalytic subunit alpha isoform
Type:Enzyme Subunit
Mol. Mass.:124294.87
Organism:Homo sapiens (Human)
Description:P42336
Residue:1068
Component 2
Name:Platelet-derived growth factor receptor beta [525-1106]
Synonyms:PDGFR PDGFR1 PGFRB_HUMAN
Type:Protein
Mol. Mass.:65194.01
Organism:Homo sapiens (Human)
Description:P09619[525-1106] modified
Residue:582
BDBM36408
NameBDBM36408
Synonyms:1-cyclobutyl-3-(3,4-dimethoxyphenyl)-1H-pyrazolo[3,4-d]pyrimidin-4-amine, PP494 | CID24905153
TypeSmall organic molecule
Emp. Form.C17H19N5O2
Mol. Mass.325.3651
SMILESCOc1ccc(cc1OC)-c1nn(C2CCC2)c2ncnc(N)c12