Reaction Details
TargetPlatelet-derived growth factor receptor beta [525-1106] /Serine/threonine-protein kinase mTOR
LigandBDBM36409
Substrate/Competitorn/a
Meas. Tech.Tyrosine Kinase Assay
IC50 4.1e+2±n/a nM
Citation Apsel, BBlair, JAGonzalez, BNazif, TMFeldman, MEAizenstein, BHoffman, RWilliams, RLShokat, KMKnight, ZA Targeted polypharmacology: discovery of dual inhibitors of tyrosine and phosphoinositide kinases. Nat Chem Biol4:691-9 (2008) 
 
Platelet-derived growth factor receptor beta [525-1106] /Serine/threonine-protein kinase mTOR
Name:Platelet-derived growth factor receptor beta [525-1106] /Serine/threonine-protein kinase mTOR
Synonyms:mTOR/ PDGFR
Type:Complex
Mol. Mass.:n/a
Description:n/a
Components:This complex has 2 components.
Component 1
Name:Serine/threonine-protein kinase mTOR
Type:Rapamycin target protein
Mol. Mass.:288917.12
Organism:Homo sapiens (Human)
Description:P42345
Residue:2549
Component 2
Name:Platelet-derived growth factor receptor beta [525-1106]
Synonyms:PDGFR PDGFR1 PGFRB_HUMAN
Type:Protein
Mol. Mass.:65194.01
Organism:Homo sapiens (Human)
Description:P09619[525-1106] modified
Residue:582
BDBM36409
NameBDBM36409
Synonyms:2-(4-amino-1-isopropyl-1H-pyrazolo[3,4-d]pyrimidin-3-yl)-1H-indol-5-ol, PP242 US10172858, Table 2.1 | US9828378, # 1
TypeSmall organic molecule
Emp. Form.C16H16N6O
Mol. Mass.308.3378
SMILESCC(C)n1nc(-c2cc3cc(O)ccc3[nH]2)c2c(N)ncnc12