Reaction Details
TargetPhosphatidylinositol 4,5-bisphosphate 3-kinase catalytic subunit delta isoform
LigandBDBM36411
Substrate/Competitorn/a
Meas. Tech.PI3K Inhibition Assay
IC50 3±n/a nM
Citation Apsel, BBlair, JAGonzalez, BNazif, TMFeldman, MEAizenstein, BHoffman, RWilliams, RLShokat, KMKnight, ZA Targeted polypharmacology: discovery of dual inhibitors of tyrosine and phosphoinositide kinases. Nat Chem Biol4:691-9 (2008) 
 
Phosphatidylinositol 4,5-bisphosphate 3-kinase catalytic subunit delta isoform
Name:Phosphatidylinositol 4,5-bisphosphate 3-kinase catalytic subunit delta isoform
Type:Enzyme Subunit
Mol. Mass.:119489.41
Organism:Homo sapiens (Human)
Description:O00329
Residue:1044
BDBM36411
NameBDBM36411
Synonyms:2-((4-amino-3-(3-hydroxyphenyl)-1H-pyrazolo[3,4-d]pyrimidin-1-yl)methyl)-5-methyl-3-o-tolylquinazolin-4(3H)-one, PIK294 PIK294
TypeSmall organic molecule
Emp. Form.C28H23N7O2
Mol. Mass.489.5279
SMILESCc1ccccc1-n1c(Cn2nc(-c3cccc(O)c3)c3c(N)ncnc23)nc2cccc(C)c2c1=O