Reaction Details
TargetPhospholipase D1
LigandBDBM123744
Substrate/Competitorn/a
Meas. Tech.PLD1 In Vitro Enzymatic Assay
Temperature310.15±0 K
IC50 9.5±0.0 nM
Citation Scott, SASelvy, PEBuck, JRCho, HPCriswell, TLThomas, ALArmstrong, MDArteaga, CLLindsley, CWBrown, HA Design of isoform-selective phospholipase D inhibitors that modulate cancer cell invasiveness. Nat Chem Biol5:108-17 (2009) 
 
Phospholipase D1
Name:Phospholipase D1
Type:Protein
Mol. Mass.:124219.92
Organism:Homo sapiens (Human)
Description:Q13393
Residue:1074
BDBM123744
NameBDBM123744
Synonyms:5-Fluoro-N-(2-(4-(2-Oxo-2,3-dihydro-1H-benzo[d]imidazol-1-yl)piperidin-1-yl)ethyl)-1H-indole-2-carboxamide, 14 FIPI hydrochloride hydrate (FIPI_HCl)
TypeSmall organic molecule
Emp. Form.C23H24FN5O2
Mol. Mass.421.4674
SMILESFc1ccc2[nH]c(cc2c1)C(=O)NCCN1CCC(CC1)n1c2ccccc2[nH]c1=O