Reaction Details
TargetPhospholipase D1
LigandBDBM20607
Substrate/Competitorn/a
Meas. Tech.d.311 Enzymatic Inhibition Assay
Temperature310.15±0 K
IC50>20000±0.0 nM
Citation Scott, SASelvy, PEBuck, JRCho, HPCriswell, TLThomas, ALArmstrong, MDArteaga, CLLindsley, CWBrown, HA Design of isoform-selective phospholipase D inhibitors that modulate cancer cell invasiveness. Nat Chem Biol5:108-17 (2009) 
 
Phospholipase D1
Name:Phospholipase D1
Type:Protein
Mol. Mass.:124219.92
Organism:Homo sapiens (Human)
Description:Q13393
Residue:1074
BDBM20607
NameBDBM20607
Synonyms:(2-{4-[(1Z)-1,2-diphenylbut-1-en-1-yl]phenoxy}ethyl)dimethylamine CHEMBL83 NCGC00024928 Tamoxifen Tamoxifen, 7 med.21724, Compound Tamoxifen
TypeSmall organic molecule
Emp. Form.C26H29NO
Mol. Mass.371.5146
SMILESCC\C(=C(/c1ccccc1)c1ccc(OCCN(C)C)cc1)c1ccccc1