Reaction Details
TargetProto-oncogene tyrosine-protein kinase Src
LigandBDBM2579
Substrate/Competitorn/a
Meas. Tech.Tyrosine Kinase Inhibition Assay
IC50 6.3± 2.9 nM
Kd 8± 3 nM
Citation Simard, JRKlüter, SGrütter, CGetlik, MRabiller, MRode, HBRauh, D A new screening assay for allosteric inhibitors of cSrc. Nat Chem Biol5:394-6 (2009) 
 
Proto-oncogene tyrosine-protein kinase Src
Name:Proto-oncogene tyrosine-protein kinase Src
Type:Tyr protein kinase
Mol. Mass.:60015.36
Organism:Gallus gallus (Chicken)
Description:P00523
Residue:533
BDBM2579
NameBDBM2579
Synonyms:(2S,3R,4R,6R)-3-methoxy-2-methyl-4-(methylamino)-29-oxa-1,7,17-triazaoctacyclo[12.12.2.1^{2,6}.0^{7,28}.0^{8,13}.0^{15,19}.0^{20,27}.0^{21,26}]nonacosa-8(13),9,11,14(28),15(19),20(27),21(26),22,24-nonaen-16-one Staurosporin, 4 Staurosporine, 8 US9206188, Staurosporine | US9226923, Staurosporine
TypeSmall organic molecule
Emp. Form.C28H26N4O3
Mol. Mass.466.531
SMILESCN[C@@H]1C[C@H]2O[C@@](C)([C@@H]1OC)n1c3ccccc3c3c4CNC(=O)c4c4c5ccccc5n2c4c13