Reaction Details
TargetKaposi's sarcoma-associated herpesvirus cyclin homolog
LigandBDBM36460
Substrate/Competitorn/a
Meas. Tech.KSHV Pr Inhibition Assay
pH8±0
Temperature303.15±0 K
IC50 3.1e+3± 2e+2 nM
Citation Shahian, TLee, GMLazic, AArnold, LAVelusamy, PRoels, CMGuy, RKCraik, CS Inhibition of a viral enzyme by a small-molecule dimer disruptor. Nat Chem Biol5:640-6 (2009) 
 
Kaposi's sarcoma-associated herpesvirus cyclin homolog
Name:Kaposi's sarcoma-associated herpesvirus cyclin homolog
Synonyms:Kaposi's sarcoma-associated herpesvirus (KSHV)
Type:Enzyme
Mol. Mass.:28080.00
Organism:Human herpesvirus 8 (HHV-8) (Kaposi's sarcoma-associated herpesvirus)
Description:Q98147
Residue:257
BDBM36460
NameBDBM36460
TypeSmall organic moelcule
Emp. Form.C27H28N2O3
Mol. Mass.428.5228
SMILESOC(=O)c1ccc(NC(=O)c2cccc(CC3CCCCC3)n2)c(Cc2ccccc2)c1