Reaction Details
TargetMitogen-activated protein kinase 14
LigandBDBM36462
Substrate/Competitorn/a
Meas. Tech.MAPK p38 Inhibition Assay
pH9.5±0
Temperature289.15±0 K
IC50<2±0.0 nM
Citation Clark, MAAcharya, RAArico-Muendel, CCBelyanskaya, SLBenjamin, DRCarlson, NRCentrella, PAChiu, CHCreaser, SPCuozzo, JWDavie, CPDing, YFranklin, GJFranzen, KDGefter, MLHale, SPHansen, NJIsrael, DIJiang, JKavarana, MJKelley, MSKollmann, CSLi, FLind, KMataruse, SMedeiros, PFMesser, JAMyers, PO'Keefe, HOliff, MCRise, CESatz, ALSkinner, SRSvendsen, JLTang, Lvan Vloten, KWagner, RWYao, GZhao, BMorgan, BA Design, synthesis and selection of DNA-encoded small-molecule libraries. Nat Chem Biol5:647-54 (2009) 
 
Mitogen-activated protein kinase 14
Name:Mitogen-activated protein kinase 14
Type:Serine/threonine-protein kinase
Mol. Mass.:41286.76
Organism:Homo sapiens (Human)
Description:Q16539
Residue:360
BDBM36462
NameBDBM36462
Synonyms:3-(4-((3-(Aminomethyl)cyclohexyl)methylamino)-6-(3,3-dimethylbutan-2-ylamino)-1,3,5-triazin-2-ylamino)-N-methoxy-4-methylbenzamide DEL-A, 2
TypeSmall organic molecule
Emp. Form.C26H42N8O2
Mol. Mass.498.6641
SMILESCONC(=O)c1ccc(C)c(Nc2nc(NCC3CCCC(CN)C3)nc(NC(C)C(C)(C)C)n2)c1