Reaction Details
TargetAurora kinase A
LigandBDBM36470
Substrate/Competitorn/a
Meas. Tech.Aurora A Inhibition Assay
pH9.5±0
Temperature289.15±0 K
IC50 2.7e+2±n/a nM
Citation Clark, MAAcharya, RAArico-Muendel, CCBelyanskaya, SLBenjamin, DRCarlson, NRCentrella, PAChiu, CHCreaser, SPCuozzo, JWDavie, CPDing, YFranklin, GJFranzen, KDGefter, MLHale, SPHansen, NJIsrael, DIJiang, JKavarana, MJKelley, MSKollmann, CSLi, FLind, KMataruse, SMedeiros, PFMesser, JAMyers, PO'Keefe, HOliff, MCRise, CESatz, ALSkinner, SRSvendsen, JLTang, Lvan Vloten, KWagner, RWYao, GZhao, BMorgan, BA Design, synthesis and selection of DNA-encoded small-molecule libraries. Nat Chem Biol5:647-54 (2009) 
 
Aurora kinase A
Name:Aurora kinase A
Type:Serine/threonine-protein kinase
Mol. Mass.:45830.98
Organism:Homo sapiens (Human)
Description:O14965
Residue:403
BDBM36470
NameBDBM36470
Synonyms:2-(4-(3,4-Dimethoxyphenylamino)-6-(quinolin-6-ylamino)-1,3,5-triazin-2-ylamino)-3-(1H-pyrrolo[2,3-b]pyridin-3-yl)propanamide | DEL-A, 11
TypeSmall organic molecule
Emp. Form.C30H28N10O3
Mol. Mass.576.6085
SMILESCOc1ccc(Nc2nc(NC(Cc3c[nH]c4ncccc34)C(N)=O)nc(Nc3ccc4ncccc4c3)n2)cc1OC