Reaction Details
TargetMitogen-activated protein kinase 14
LigandBDBM36472
Substrate/Competitorn/a
Meas. Tech.MAPK p38 Inhibition Assay
pH9.5±0
Temperature289.15±0 K
EC50 2.5e+2±n/a nM
Citation Clark, MAAcharya, RAArico-Muendel, CCBelyanskaya, SLBenjamin, DRCarlson, NRCentrella, PAChiu, CHCreaser, SPCuozzo, JWDavie, CPDing, YFranklin, GJFranzen, KDGefter, MLHale, SPHansen, NJIsrael, DIJiang, JKavarana, MJKelley, MSKollmann, CSLi, FLind, KMataruse, SMedeiros, PFMesser, JAMyers, PO'Keefe, HOliff, MCRise, CESatz, ALSkinner, SRSvendsen, JLTang, Lvan Vloten, KWagner, RWYao, GZhao, BMorgan, BA Design, synthesis and selection of DNA-encoded small-molecule libraries. Nat Chem Biol5:647-54 (2009) 
 
Mitogen-activated protein kinase 14
Name:Mitogen-activated protein kinase 14
Type:Serine/threonine-protein kinase
Mol. Mass.:41286.76
Organism:Homo sapiens (Human)
Description:Q16539
Residue:360
BDBM36472
NameBDBM36472
Synonyms:(S)-3-(2,2-Dimethyl-4H-benzo[d][1,3]dioxin-6-yl)-2-(4-(isobutylamino)-6-(5-(1,2,3,4-tetrahydroquinoline-1-carbonyl)-1H-benzo[d]imidazol-1-yl)-1,3,5-triazin-2-ylamino)-N-methylpropanamide | DEL-B, 13
TypeSmall organic molecule
Emp. Form.C38H43N9O4
Mol. Mass.689.8059
SMILESCNC(=O)[C@H](Cc1ccc2OC(C)(C)OCc2c1)Nc1nc(NCC(C)C)nc(n1)-n1cnc2cc(ccc12)C(=O)N1CCCc2ccccc12