Reaction Details
TargetEstrogen receptor
LigandBDBM36490
Substrate/Competitorn/a
Meas. Tech.Competitive Binding Assay
Ki 4.1±0.0 nM
Citation Revankar, CMMitchell, HDField, ASBurai, RCorona, CRamesh, CSklar, LAArterburn, JBProssnitz, ER Synthetic estrogen derivatives demonstrate the functionality of intracellular GPR30. ACS Chem Biol2:536-44 (2007) 
 
Estrogen receptor
Name:Estrogen receptor
Type:Protein
Mol. Mass.:66230.44
Organism:Homo sapiens (Human)
Description:P03372
Residue:595
BDBM36490
NameBDBM36490
Synonyms:E2-NH3+
TypeSmall organic molecule
Emp. Form.C27H32NO2
Mol. Mass.402.5479
SMILESC[C@]12CCC3C(CCc4cc(O)ccc34)C1CC[C@@]2(O)C#Cc1ccc(C[NH3+])cc1