Reaction Details
TargetEstrogen receptor
LigandBDBM36493
Substrate/Competitorn/a
Meas. Tech.Competitive Binding Assay
Ki 2.7±0.0 nM
Citation Revankar, CMMitchell, HDField, ASBurai, RCorona, CRamesh, CSklar, LAArterburn, JBProssnitz, ER Synthetic estrogen derivatives demonstrate the functionality of intracellular GPR30. ACS Chem Biol2:536-44 (2007) 
 
Estrogen receptor
Name:Estrogen receptor
Type:Protein
Mol. Mass.:66230.44
Organism:Homo sapiens (Human)
Description:P03372
Residue:595
BDBM36493
NameBDBM36493
Synonyms:E2-NB
TypeSmall organic molecule
Emp. Form.C32H39NO4
Mol. Mass.501.6564
SMILESCC(C)(C)OC(=O)NCc1ccc(cc1)C#C[C@]1(O)CCC2C3CCc4cc(O)ccc4C3CC[C@]12C