Reaction Details
TargetAdenosylhomocysteine nucleosidase
LigandBDBM36435
Substrate/CompetitorBDBM22111
Meas. Tech.Enzyme Activity Assay
pH7.5±0
Temperature298.15±0 K
Kd 0.515±0.0 nM
Citation Gutierrez, JALuo, MSingh, VLi, LBrown, RLNorris, GEEvans, GBFurneaux, RHTyler, PCPainter, GFLenz, DHSchramm, VL Picomolar inhibitors as transition-state probes of 5'-methylthioadenosine nucleosidases. ACS Chem Biol2:725-34 (2007) 
 
Adenosylhomocysteine nucleosidase
Name:Adenosylhomocysteine nucleosidase
Type:Enzyme
Mol. Mass.:25233.34
Organism:Helicobacter pylori
Description:D0IQW9
Residue:231
BDBM36435
BDBM22111
NameBDBM36435
Synonyms:(3R,4S)-1-[(9-Deaza-adenin-9-yl)methyl]-4-ethylthio-methyl-3-hydroxypyrrolidine, 8 DADMe-ImmA-Et
TypeSmall organic molecule
Emp. Form.C14H21N5OS
Mol. Mass.307.414
SMILESCCSC[C@H]1CN(Cc2c[nH]c3c(N)ncnc23)C[C@@H]1O