Reaction Details
Target5'-methylthioadenosine/S-adenosylhomocysteine nucleosidase
LigandBDBM36497
Substrate/CompetitorBDBM22111
Meas. Tech.Enzyme Activity Assay
pH7.5±0
Temperature298.15±0 K
Kd 0.841±0.0 nM
Citation Gutierrez, JALuo, MSingh, VLi, LBrown, RLNorris, GEEvans, GBFurneaux, RHTyler, PCPainter, GFLenz, DHSchramm, VL Picomolar inhibitors as transition-state probes of 5'-methylthioadenosine nucleosidases. ACS Chem Biol2:725-34 (2007) 
 
5'-methylthioadenosine/S-adenosylhomocysteine nucleosidase
Name:5'-methylthioadenosine/S-adenosylhomocysteine nucleosidase
Type:Enzyme
Mol. Mass.:24526.81
Organism:Staphylococcus aureus
Description:Q5HFG2
Residue:228
BDBM36497
BDBM22111
NameBDBM36497
Synonyms:CHEMBL191436 | DADMe-ImmA-Bn
TypeSmall organic molecule
Emp. Form.C19H23N5OS
Mol. Mass.369.484
SMILESNc1ncnc2c(CN3CC(O)C(CSCc4ccccc4)C3)c[nH]c12