Reaction Details
TargetAdenosylhomocysteine nucleosidase
LigandBDBM36494
Substrate/CompetitorBDBM22111
Meas. Tech.Enzyme Activity Assay
pH7.5±0
Temperature298.15±0 K
Kd 40±0.0 nM
Citation Gutierrez, JALuo, MSingh, VLi, LBrown, RLNorris, GEEvans, GBFurneaux, RHTyler, PCPainter, GFLenz, DHSchramm, VL Picomolar inhibitors as transition-state probes of 5'-methylthioadenosine nucleosidases. ACS Chem Biol2:725-34 (2007) 
 
Adenosylhomocysteine nucleosidase
Name:Adenosylhomocysteine nucleosidase
Type:Enzyme
Mol. Mass.:24666.14
Organism:Streptococcus pneumoniae
Description:J0VBT9
Residue:230
BDBM36494
BDBM22111
NameBDBM36494
Synonyms:CHEMBL554965 | ImmA-Et
TypeSmall organic molecule
Emp. Form.C13H19N5O2S
Mol. Mass.309.387
SMILESCCSCC1NC(C(O)C1O)c1c[nH]c2c(N)ncnc12