Reaction Details
TargetAdenosylhomocysteine nucleosidase
LigandBDBM36496
Substrate/CompetitorBDBM22111
Meas. Tech.Enzyme Activity Assay
pH7.5±0
Temperature298.15±0 K
Kd 190±0.0 nM
Citation Gutierrez, JALuo, MSingh, VLi, LBrown, RLNorris, GEEvans, GBFurneaux, RHTyler, PCPainter, GFLenz, DHSchramm, VL Picomolar inhibitors as transition-state probes of 5'-methylthioadenosine nucleosidases. ACS Chem Biol2:725-34 (2007) 
 
Adenosylhomocysteine nucleosidase
Name:Adenosylhomocysteine nucleosidase
Type:Enzyme
Mol. Mass.:24666.14
Organism:Streptococcus pneumoniae
Description:J0VBT9
Residue:230
BDBM36496
BDBM22111
NameBDBM36496
Synonyms:CHEMBL552894 | ImmA-pClPh
TypeSmall organic molecule
Emp. Form.C17H18ClN5O2S
Mol. Mass.391.875
SMILESNc1ncnc2c(c[nH]c12)C1NC(CSc2ccc(Cl)cc2)C(O)C1O