Reaction Details
TargetLysosomal acid glucosylceramidase
LigandBDBM36513
Substrate/CompetitorBDBM18352
Meas. Tech.Enzymatic Activity Assay
pH5.2±0
Temperature310.15±0 K
Ki 44± 7 nM
IC50 1.2e+2± 4 nM
Citation Witte, MDKallemeijn, WWAten, JLi, KYStrijland, ADonker-Koopman, WEvan den Nieuwendijk, AMBleijlevens, BKramer, GFlorea, BIHooibrink, BHollak, CEOttenhoff, RBoot, RGvan der Marel, GAOverkleeft, HSAerts, JM Ultrasensitive in situ visualization of active glucocerebrosidase molecules. Nat Chem Biol6:907-13 (2010) 
 
Lysosomal acid glucosylceramidase
Name:Lysosomal acid glucosylceramidase
Type:Enzyme
Mol. Mass.:59724.64
Organism:Homo sapiens (Human)
Description:The beta-Glu activity was measured with commercially available beta-glucocerebrosidase (Ceredase) as the enzyme source.
Residue:536
BDBM36513
BDBM18352
NameBDBM36513
Synonyms:CID46912128 US9056847, Azido-cyclophellitol
TypeSmall organic molecule
Emp. Form.C7H11N3O4
Mol. Mass.201.1799
SMILESO[C@H]1[C@@H]2O[C@@H]2[C@H](CN=[N+]=[N-])[C@@H](O)[C@@H]1O