Reaction Details
TargetProtein O-GlcNAcase
LigandBDBM36548
Substrate/CompetitorBDBM18365
Meas. Tech.Enzyme Inhibition Assay
pH4.25±0
Temperature303.15±0 K
Ki 1.756e+5± 2.15e+3 nM
Citation Ho, CWPopat, SDLiu, TWTsai, KCHo, MJChen, WHYang, ASLin, CH Development of GlcNAc-inspired iminocyclitiols as potent and selective N-acetyl-beta-hexosaminidase inhibitors. ACS Chem Biol5:489-97 (2010) 
 
Protein O-GlcNAcase
Name:Protein O-GlcNAcase
Type:Enzyme
Mol. Mass.:102874.67
Organism:Homo sapiens (Human)
Description:O60502
Residue:916
BDBM36548
BDBM18365
NameBDBM36548
Synonyms:N-[1-(7-{bis[(4-methoxyphenyl)methyl]amino}heptyl)-4,5-dihydroxy-6-(hydroxymethyl)piperidin-3-yl]acetamide, 4
TypeSmall organic molecule
Emp. Form.C31H47N3O6
Mol. Mass.557.7214
SMILESCOc1ccc(CN(CCCCCCCN2CC(NC(C)=O)C(O)C(O)C2CO)Cc2ccc(OC)cc2)cc1