Reaction Details
TargetCarboxylic ester hydrolase
LigandBDBM36552
Substrate/Competitorn/a
Meas. Tech.Enzyme Inhibition Assay
pH7.4±0
Temperature310.15±0 K
IC50 4.490e+4± 6.10e+3 nM
Citation Zheng, HYoudim, MBFridkin, M Site-activated chelators targeting acetylcholinesterase and monoamine oxidase for Alzheimer's therapy. ACS Chem Biol5:603-10 (2010) 
 
Carboxylic ester hydrolase
Name:Carboxylic ester hydrolase
Type:Enzyme
Mol. Mass.:67776.22
Organism:Rattus norvegicus (rat)
Description:n/a
Residue:597
BDBM36552
NameBDBM36552
Synonyms:Prochelators, 2
TypeSmall organic molecule
Emp. Form.C17H19N3O2
Mol. Mass.297.3517
SMILESCN(CC#C)Cc1ccc(OC(=O)N(C)C)c2ncccc12