Reaction Details
TargetAmine oxidase [flavin-containing] B
LigandBDBM36552
Substrate/Competitorn/a
Meas. Tech.Enzyme Inhibition Assay
pH7.4±0
Temperature310.15±0 K
IC50 7.90e+3± 1.34e+3 nM
Citation Zheng, HYoudim, MBFridkin, M Site-activated chelators targeting acetylcholinesterase and monoamine oxidase for Alzheimer's therapy. ACS Chem Biol5:603-10 (2010) 
 
Amine oxidase [flavin-containing] B
Name:Amine oxidase [flavin-containing] B
Type:Enzyme
Mol. Mass.:58469.65
Organism:Rattus norvegicus (rat)
Description:P19643
Residue:520
BDBM36552
NameBDBM36552
Synonyms:Prochelators, 2
TypeSmall organic molecule
Emp. Form.C17H19N3O2
Mol. Mass.297.3517
SMILESCN(CC#C)Cc1ccc(OC(=O)N(C)C)c2ncccc12