Reaction Details
TargetCathepsin D
LigandBDBM36570
Substrate/Competitorn/a
Meas. Tech.High Through-Put Fluorescence Assay
pH3.7±0
Ki 9±0 nM
IC50 14±2 nM
Citation Kick, EKRoe, DCSkillman, AGLiu, GEwing, TJSun, YKuntz, IDEllman, JA Structure-based design and combinatorial chemistry yield low nanomolar inhibitors of cathepsin D. Chem Biol4:297-307 (1997) 
 
Cathepsin D
Name:Cathepsin D
Type:Enzyme
Mol. Mass.:44551.72
Organism:Homo sapiens (Human)
Description:Human proCathepsin D (SwissProt accession number P07339) was expressed in Sf9 cells, purified, and autoactivated.
Residue:412
BDBM36570
NameBDBM36570
Synonyms:EHM
TypeSmall organic molecule
Emp. Form.C37H33Cl2N3O8
Mol. Mass.718.579
SMILESOC(CN(CCc1ccc2OCOc2c1)C(=O)CCN1C(=O)c2ccccc2C1=O)[C@@H](NC(=O)COc1ccc(Cl)cc1Cl)c1ccccc1