Reaction Details
TargetMethionine aminopeptidase 2
LigandBDBM36596
Substrate/Competitorn/a
Meas. Tech.Proliferation Assay
pH7.5±0
EC50 2.2±1.4 nM
Citation Griffith, ECSu, ZTurk, BEChen, SChang, YHWu, ZBiemann, KLiu, JO Methionine aminopeptidase (type 2) is the common target for angiogenesis inhibitors AGM-1470 and ovalicin. Chem Biol4:461-71 (1997) 
 
Methionine aminopeptidase 2
Name:Methionine aminopeptidase 2
Type:Enzyme
Mol. Mass.:52914.64
Organism:Mus musculus (Mouse)
Description:O08663
Residue:478
BDBM36596
NameBDBM36596
Synonyms:FOS-34
TypeSmall organic molecule
Emp. Form.C16H26O5
Mol. Mass.298.3746
SMILES[#6]-[#8]-[#6@@H]1-[#6@H](-[#8])-[#6]-[#6][C@]2([#6]-[#8]2)[C@@]1([#8])[C@]1([#6])[#8]-[#6]1-[#6]\[#6]=[#6](\[#6])-[#6]