Reaction Details
TargetcAMP-dependent protein kinase
LigandBDBM36602
Substrate/Competitorn/a
Meas. Tech.Inhibition Assay
pH7.5±0
Temperature303.15±0 K
Ki 11±0 nM
IC50 18±0.0 nM
Citation Koide, KBunnage, MEGomez Paloma, LKanter, JRTaylor, SSBrunton, LLNicolaou, KC Molecular design and biological activity of potent and selective protein kinase inhibitors related to balanol. Chem Biol2:601-8 (1995) 
 
cAMP-dependent protein kinase
Name:cAMP-dependent protein kinase
Type:Enzyme
Mol. Mass.:40766.33
Organism:Oryctolagus cuniculus (Rabbit)
Description:Q95J97
Residue:351
BDBM36602
NameBDBM36602
Synonyms:14''-Decarboxybalanol hydrochloride, 5
TypeSmall organic molecule
Emp. Form.C27H27N2O8
Mol. Mass.507.5113
SMILESOc1ccc(cc1)C(=O)N[C@@H]1C[NH2+]CCC[C@H]1OC(=O)c1cc(O)c(C(=O)c2ccccc2O)c(O)c1