Reaction Details
TargetcAMP-dependent protein kinase
LigandBDBM2579
Substrate/Competitorn/a
Meas. Tech.Inhibition Assay
pH7.5±0
Ki 35±0 nM
Citation Koide, KBunnage, MEGomez Paloma, LKanter, JRTaylor, SSBrunton, LLNicolaou, KC Molecular design and biological activity of potent and selective protein kinase inhibitors related to balanol. Chem Biol2:601-8 (1995) 
 
cAMP-dependent protein kinase
Name:cAMP-dependent protein kinase
Type:Enzyme
Mol. Mass.:40766.33
Organism:Oryctolagus cuniculus (Rabbit)
Description:Q95J97
Residue:351
BDBM2579
NameBDBM2579
Synonyms:(2S,3R,4R,6R)-3-methoxy-2-methyl-4-(methylamino)-29-oxa-1,7,17-triazaoctacyclo[12.12.2.1^{2,6}.0^{7,28}.0^{8,13}.0^{15,19}.0^{20,27}.0^{21,26}]nonacosa-8(13),9,11,14(28),15(19),20(27),21(26),22,24-nonaen-16-one Staurosporin, 4 Staurosporine, 8 US9206188, Staurosporine | US9226923, Staurosporine
TypeSmall organic molecule
Emp. Form.C28H26N4O3
Mol. Mass.466.531
SMILESCN[C@@H]1C[C@H]2O[C@@](C)([C@@H]1OC)n1c3ccccc3c3c4CNC(=O)c4c4c5ccccc5n2c4c13