Reaction Details
TargetPeptidyl-prolyl cis-trans isomerase FKBP1A
LigandBDBM36614
Substrate/Competitorn/a
Meas. Tech.FKBP12 Assay
Ki 4.5±0.0 nM
EC50>10000±0.0 nM
Citation Luengo, JIYamashita, DSDunnington, DBeck, AKRozamus, LWYen, HKBossard, MJLevy, MAHand, ANewman-Tarr, T Structure-activity studies of rapamycin analogs: evidence that the C-7 methoxy group is part of the effector domain and positioned at the FKBP12-FRAP interface. Chem Biol2:471-81 (1995) 
 
Peptidyl-prolyl cis-trans isomerase FKBP1A
Name:Peptidyl-prolyl cis-trans isomerase FKBP1A
Type:Isomerase
Mol. Mass.:11953.09
Organism:Homo sapiens (Human)
Description:P62942
Residue:108
BDBM36614
NameBDBM36614
Synonyms:Rapamycin C-7, analog 7a
TypeSmall organic molecule
Emp. Form.C52H80N2O14
Mol. Mass.957.1966
SMILESCO[C@@H]1C[C@H](C[C@@H](C)[C@@H]2CC(=O)[C@H](C)\C=C(C)\[C@@H](O)[C@@H](OC)C(=O)[C@H](C)C[C@H](C)\C=C\C=C\C=C(C)\[C@@H](C[C@@H]3CC[C@@H](C)[C@@](O)(O3)C(=O)C(=O)N3CCCC[C@H]3C(=O)O2)NC(=O)OC)CC[C@H]1O