Reaction Details
Target1-aminocyclopropane-1-carboxylate oxidase 1
LigandBDBM36629
Substrate/Competitorn/a
Meas. Tech.Inhibition Assay
Ki 1.50e+5±n/a nM
Citation Pirrung, MCCao, JChen, J Ethylene biosynthesis: processing of a substrate analog supports a radical mechanism for the ethylene-forming enzyme. Chem Biol5:49-57 (1998) 
 
1-aminocyclopropane-1-carboxylate oxidase 1
Name:1-aminocyclopropane-1-carboxylate oxidase 1
Type:Enzyme
Mol. Mass.:35402.01
Organism:Malus domestica (Apple) (Pyrus malus)
Description:Q00985
Residue:314
BDBM36629
NameBDBM36629
Synonyms:Aminoisobutyric (AIB)
TypeSmall organic molecule
Emp. Form.C4H9NO2
Mol. Mass.103.1198
SMILESCC(C)([NH3+])C([O-])=O