Reaction Details
TargetThyroid hormone receptor alpha
LigandBDBM50115668
Substrate/Competitorn/a
Meas. Tech.TR Receptor Ligand Binding Assay
Kd 0.44±0.120 nM
Citation Chiellini, GApriletti, JWYoshihara, HABaxter, JDRibeiro, RCScanlan, TS A high-affinity subtype-selective agonist ligand for the thyroid hormone receptor. Chem Biol5:299-306 (1998) 
 
Thyroid hormone receptor alpha
Name:Thyroid hormone receptor alpha
Type:Receptor
Mol. Mass.:54818.00
Organism:Homo sapiens (Human)
Description:Recombinant hThR was obtained from nuclear extracts from SF9 cells infected with baculovirus vectors encoding for ThRalpha 1.
Residue:490
BDBM50115668
NameBDBM50115668
Synonyms:3,5-dimethyl-4-(4'-hydroxy-3'-isopropylbenzyl)phenoxyacetic acid GC-1 US10544075, Compound GC-1 [4-(4-Hydroxy-3-isopropyl-benzyl)-3,5-dimethyl-phenoxy]-acetic acid(GC-1) | {4-[4-hydroxy-3-(1-methylethyl)benzyl]-3,5-dimethylphenoxy}acetic acid
TypeSmall organic molecule
Emp. Form.C20H24O4
Mol. Mass.328.4022
SMILESCC(C)c1cc(Cc2c(C)cc(OCC(O)=O)cc2C)ccc1O