Reaction Details
TargetHIV-1 protease
LigandBDBM36656
Substrate/Competitorn/a
Meas. Tech.Protease Inhibtion Assay
pH5.5±0
Ki 0.016±0.0 nM
Citation Rodgers, JDLam, PYJohnson, BLWang, HLi, RRu, YKo, SSSeitz, SPTrainor, GLAnderson, PSKlabe, RMBacheler, LTCordova, BGarber, SReid, CWright, MRChang, CHErickson-Viitanen, S Design and selection of DMP 850 and DMP 851: the next generation of cyclic urea HIV protease inhibitors. Chem Biol5:597-608 (1998) 
 
HIV-1 protease
Name:HIV-1 protease
Synonyms:HIV-1 protease wild type
Type:Protein
Mol. Mass.:10757.68
Organism:Human immunodeficiency virus
Description:O90785
Residue:99
BDBM36656
NameBDBM36656
Synonyms:Cyclobutylmethyl cyclic urea
TypeSmall organic molecule
Emp. Form.C32H37N5O3
Mol. Mass.539.6679
SMILESNc1n[nH]c2ccc(CN3[C@H](Cc4ccccc4)[C@H](O)[C@@H](O)[C@@H](Cc4ccccc4)N(CC4CCC4)C3=O)cc12