Reaction Details
TargetMitogen-activated protein kinase kinase kinase kinase 5
LigandBDBM21079
Substrate/Competitorn/a
Meas. Tech.Kinase Inhibitor Selectivity Profiling Assay
Kd 910±n/a nM
Citation PubChem, PC Kinase Inhibitor Selectivity Profiling Assay PubChem Bioassay(2008)[AID]
 
Mitogen-activated protein kinase kinase kinase kinase 5
Name:Mitogen-activated protein kinase kinase kinase kinase 5
Type:PROTEIN
Mol. Mass.:95039.51
Organism:Homo sapiens (Human)
Description:ChEMBL_1495741
Residue:846
BDBM21079
NameBDBM21079
Synonyms:1-[4-(3-amino-1H-indazol-4-yl)phenyl]-3-(2-fluoro-5-methyl-phenyl)urea 1-[4-(3-azanyl-1H-indazol-4-yl)phenyl]-3-(2-fluoranyl-5-methyl-phenyl)urea ABT-869 CHEMBL223360 | cid_11485656
TypeSmall organic molecule
Emp. Form.C21H18FN5O
Mol. Mass.375.3989
SMILESCc1ccc(F)c(NC(=O)Nc2ccc(cc2)-c2cccc3[nH]nc(N)c23)c1