Reaction Details
TargetMAP kinase-interacting serine/threonine-protein kinase 1
LigandBDBM5447
Substrate/Competitorn/a
Meas. Tech.Kinase Inhibitor Selectivity Profiling Assay
Kd 290±n/a nM
Citation PubChem, PC Kinase Inhibitor Selectivity Profiling Assay PubChem Bioassay(2008)[AID]
 
MAP kinase-interacting serine/threonine-protein kinase 1
Name:MAP kinase-interacting serine/threonine-protein kinase 1
Type:Serine/threonine-protein kinase
Mol. Mass.:51342.85
Organism:Homo sapiens (Human)
Description:Q9BUB5
Residue:465
BDBM5447
NameBDBM5447
Synonyms:CHEMBL939 Iressa N-(3-chloro-4-fluorophenyl)-7-methoxy-6-[3-(morpholin-4-yl)propoxy]quinazolin-4-amine US10507209, Compound Gefitinib US9730934, Gefitinib WO2022090481, Example gefitinib cid_123631
TypeSmall organic molecule
Emp. Form.C22H24ClFN4O3
Mol. Mass.446.902
SMILESCOc1cc2ncnc(Nc3ccc(F)c(Cl)c3)c2cc1OCCCN1CCOCC1