Reaction Details
TargetMuscle, skeletal receptor tyrosine-protein kinase
LigandBDBM26300
Substrate/Competitorn/a
Meas. Tech.Kinase Inhibitor Selectivity Profiling Assay
Kd 1500±n/a nM
Citation PubChem, PC Kinase Inhibitor Selectivity Profiling Assay PubChem Bioassay(2008)[AID]
 
Muscle, skeletal receptor tyrosine-protein kinase
Name:Muscle, skeletal receptor tyrosine-protein kinase
Type:PROTEIN
Mol. Mass.:97062.85
Organism:Homo sapiens (Human)
Description:ChEMBL_1474077
Residue:869
BDBM26300
NameBDBM26300
Synonyms:2-{3-[(7-{3-[ethyl(2-hydroxyethyl)amino]propoxy}quinazolin-4-yl)amino]-1H-pyrazol-5-yl}-N-(3-fluorophenyl)acetamide cid_16007391 | pyrazoloquinazoline deriv., 34
TypeSmall organic molecule
Emp. Form.C26H30FN7O3
Mol. Mass.507.5599
SMILESCCN(CCO)CCCOc1ccc2c(Nc3cc(CC(=O)Nc4cccc(F)c4)n[nH]3)ncnc2c1