Reaction Details
TargetPlatelet-derived growth factor receptor beta
LigandBDBM31096
Substrate/Competitorn/a
Meas. Tech.Kinase Inhibitor Selectivity Profiling Assay
Kd 1.8±n/a nM
Citation PubChem, PC Kinase Inhibitor Selectivity Profiling Assay PubChem Bioassay(2008)[AID]
 
Platelet-derived growth factor receptor beta
Name:Platelet-derived growth factor receptor beta
Type:Enzyme
Mol. Mass.:123922.25
Organism:Homo sapiens (Human)
Description:P09619
Residue:1106
BDBM31096
NameBDBM31096
Synonyms:CHEMBL290084 cid_451705
TypeSmall organic molecule
Emp. Form.C28H26N4O3
Mol. Mass.466.531
SMILESCN[C@H]1C[C@@H]2O[C@](C)([C@H]1OC)n1c3ccccc3c3c4CNC(=O)c4c4c5ccccc5n2c4c13