Reaction Details
TargetProto-oncogene tyrosine-protein kinase receptor Ret [1-999,M918T]
LigandBDBM21
Substrate/Competitorn/a
Meas. Tech.Kinase Inhibitor Selectivity Profiling Assay
Kd 14±n/a nM
Citation PubChem, PC Kinase Inhibitor Selectivity Profiling Assay PubChem Bioassay(2008)[AID]
 
Proto-oncogene tyrosine-protein kinase receptor Ret [1-999,M918T]
Name:Proto-oncogene tyrosine-protein kinase receptor Ret [1-999,M918T]
Type:Enzyme Catalytic Domain
Mol. Mass.:111542.26
Organism:Homo sapiens (Human)
Description:P07949[1-999,M918T]
Residue:999
BDBM21
NameBDBM21
Synonyms:CHEMBL24828 VANDETANIB ZD6474 | cid_3081361
Typen/a
Emp. Form.C22H24BrFN4O2
Mol. Mass.475.354
SMILESCOc1cc2c(Nc3ccc(Br)cc3F)ncnc2cc1OCC1CCN(C)CC1