Reaction Details
TargetTyrosine-protein kinase receptor Tie-1
LigandBDBM26300
Substrate/Competitorn/a
Meas. Tech.Kinase Inhibitor Selectivity Profiling Assay
Kd 350±n/a nM
Citation PubChem, PC Kinase Inhibitor Selectivity Profiling Assay PubChem Bioassay(2008)[AID]
 
Tyrosine-protein kinase receptor Tie-1
Name:Tyrosine-protein kinase receptor Tie-1
Type:PROTEIN
Mol. Mass.:125096.89
Organism:Homo sapiens (Human)
Description:ChEMBL_1498731
Residue:1138
BDBM26300
NameBDBM26300
Synonyms:2-{3-[(7-{3-[ethyl(2-hydroxyethyl)amino]propoxy}quinazolin-4-yl)amino]-1H-pyrazol-5-yl}-N-(3-fluorophenyl)acetamide cid_16007391 | pyrazoloquinazoline deriv., 34
TypeSmall organic molecule
Emp. Form.C26H30FN7O3
Mol. Mass.507.5599
SMILESCCN(CCO)CCCOc1ccc2c(Nc3cc(CC(=O)Nc4cccc(F)c4)n[nH]3)ncnc2c1