Reaction Details
TargetThymidylate synthase
LigandBDBM36673
Substrate/Competitorn/a
Meas. Tech.Enzyme Assay
pH7.4±0
Temperature293.15±0 K
IC50 1.40e+5±n/a nM
Citation Tondi, DSlomczynska, UCosti, MPWatterson, DMGhelli, SShoichet, BK Structure-based discovery and in-parallel optimization of novel competitive inhibitors of thymidylate synthase. Chem Biol6:319-31 (1999) 
 
Thymidylate synthase
Name:Thymidylate synthase
Type:Enzyme
Mol. Mass.:36576.54
Organism:Lactobacillus casei
Description:n/a
Residue:316
BDBM36673
NameBDBM36673
Synonyms:Dansyl derivatives 11A, (S) isomer
TypeSmall organic molecule
Emp. Form.C21H24N4O3S
Mol. Mass.412.505
SMILESCN(C)c1cccc2c(cccc12)S(=O)(=O)Nc1ccc(CC(N)C(N)=O)cc1