Reaction Details
TargetThymidylate synthase
LigandBDBM36699
Substrate/Competitorn/a
Meas. Tech.Enzyme Assay
pH7.4±0
Temperature293.15±0 K
IC50 1.9e+4±n/a nM
Citation Tondi, DSlomczynska, UCosti, MPWatterson, DMGhelli, SShoichet, BK Structure-based discovery and in-parallel optimization of novel competitive inhibitors of thymidylate synthase. Chem Biol6:319-31 (1999) 
 
Thymidylate synthase
Name:Thymidylate synthase
Type:Enzyme
Mol. Mass.:36576.54
Organism:Lactobacillus casei
Description:n/a
Residue:316
BDBM36699
NameBDBM36699
Synonyms:Dansyl derivative, 8L | Dansyltyrosine deriviative 16B
TypeSmall organic molecule
Emp. Form.C28H28N2O7S2
Mol. Mass.568.661
SMILESCN(C)c1cccc2c(cccc12)S(=O)(=O)Oc1ccc(C[C@H](NS(=O)(=O)Cc2ccccc2)C(O)=O)cc1