Reaction Details
TargetThymidylate synthase
LigandBDBM36701
Substrate/Competitorn/a
Meas. Tech.Enzyme Assay
pH7.4±0
Temperature293.15±0 K
IC50 1.0e+4±n/a nM
Citation Tondi, DSlomczynska, UCosti, MPWatterson, DMGhelli, SShoichet, BK Structure-based discovery and in-parallel optimization of novel competitive inhibitors of thymidylate synthase. Chem Biol6:319-31 (1999) 
 
Thymidylate synthase
Name:Thymidylate synthase
Type:Enzyme
Mol. Mass.:36576.54
Organism:Lactobacillus casei
Description:n/a
Residue:316
BDBM36701
NameBDBM36701
Synonyms:Dansyl derivative, 3L | Dansyltyrosine deriviative 19B
TypeSmall organic molecule
Emp. Form.C27H25N3O9S2
Mol. Mass.599.632
SMILESCN(C)c1cccc2c(cccc12)S(=O)(=O)Oc1ccc(C[C@H](NS(=O)(=O)c2ccc(cc2)N(=O)=O)C(O)=O)cc1