Reaction Details
TargetThymidylate synthase
LigandBDBM50161779
Substrate/Competitorn/a
Meas. Tech.Enzyme Assay
pH7.4±0
Temperature293.15±0 K
IC50 3.4e+3±n/a nM
Citation Tondi, DSlomczynska, UCosti, MPWatterson, DMGhelli, SShoichet, BK Structure-based discovery and in-parallel optimization of novel competitive inhibitors of thymidylate synthase. Chem Biol6:319-31 (1999) 
 
Thymidylate synthase
Name:Thymidylate synthase
Type:Enzyme
Mol. Mass.:36576.54
Organism:Lactobacillus casei
Description:n/a
Residue:316
BDBM50161779
NameBDBM50161779
Synonyms:(S)-2-(5-Dimethylamino-naphthalene-1-sulfonylamino)-3-[4-(5-dimethylamino-naphthalene-1-sulfonyloxy)-phenyl]-propionic acid Dansyl derivative, DDT, 1L Dansyltyrosine deriviative 21B N,O-diansyl-L-tyrosine
TypeSmall organic molecule
Emp. Form.C33H33N3O7S2
Mol. Mass.647.761
SMILESCN(C)c1cccc2c(cccc12)S(=O)(=O)N[C@@H](Cc1ccc(OS(=O)(=O)c2cccc3c(cccc23)N(C)C)cc1)C(O)=O